Target
Aurora kinase B
Ligand
BDBM50277678
Substrate
Meas. Tech.
ChEMBL_501649 (CHEMBL993739)
IC50
9.5±n/a nM
Citation
 Pollard, JRMortimore, M Discovery and development of aurora kinase inhibitors as anticancer agents. J Med Chem 52:2629-51 (2009)  
Target
Name:
Aurora kinase B
Synonyms:
AIK2 AIM1 ARK2 AURKB_HUMAN Aurora B-INCENP Aurora kinase B (AURKB) STK-1 STK12 Serine/threonine-protein kinase aurora B
Type:
Protein
Mol. Mass.:
39327.72
Organism:
Homo sapiens (Human)
Description:
Q96GD4
Residue:
344
  
Inhibitor
Name:
BDBM50277678
Synonyms:
CHEMBL485186 | N-(4-(4-(4-cyclopropylpiperazin-1-yl)-6-(5-methyl-1H-pyrazol-3-ylamino)pyrimidin-2-ylthio)phenyl)propionamide
Type:
Small organic molecule
Emp. Form.:
C24H30N8OS
Mol. Mass.:
478.613
SMILES:
CCC(=O)Nc1ccc(Sc2nc(Nc3cc(C)n[nH]3)cc(n2)N2CCN(CC2)C2CC2)cc1
: