Target
Class A beta-lactamase BCL-1
Ligand
BDBM50021959
Substrate
Meas. Tech.
ChEMBL_521247 (CHEMBL1002558)
IC50
85±n/a nM
Citation
 Girlich, DLeclercq, RNaas, TNordmann, P Molecular and biochemical characterization of the chromosome-encoded class A beta-lactamase BCL-1 from Bacillus clausii. Antimicrob Agents Chemother 51:4009-14 (2007)  
Target
Name:
Class A beta-lactamase BCL-1
Synonyms:
Beta-lactamase
Type:
PROTEIN
Mol. Mass.:
33479.14
Organism:
Bacillus clausii
Description:
ChEMBL_521247
Residue:
307
  
Inhibitor
Name:
BDBM50021959
Synonyms:
CHEMBL777 US9120808, Clavulanic acid potassium salt clavulanic acid
Type:
Small organic molecule
Emp. Form.:
C8H9NO5
Mol. Mass.:
199.1608
SMILES:
OC\C=C1/O[C@@H]2CC(=O)N2[C@H]1C(O)=O
: