Target
Beta-2 adrenergic receptor
Ligand
BDBM50295572
Substrate
Meas. Tech.
ChEMBL_577586 (CHEMBL1058735)
Kd
4810±n/a nM
Citation
 Soriano-Ursúa, MAValencia-Hernández, IArellano-Mendoza, MGCorrea-Basurto, JTrujillo-Ferrara, JG Synthesis, pharmacological and in silico evaluation of 1-(4-di-hydroxy-3,5-dioxa-4-borabicyclo[4.4.0]deca-7,9,11-trien-9-yl)-2-(tert-butylamino)ethanol, a compound designed to act as a beta2 adrenoceptor agonist. Eur J Med Chem 44:2840-6 (2009)  
Target
Name:
Beta-2 adrenergic receptor
Synonyms:
ADRB2 ADRB2_HUMAN Beta-2 adrenoceptor | Beta-2 adrenoreceptor
Type:
Mol. Mass.:
46461.69
Organism:
Homo sapiens (Human)
Description:
P07550
Residue:
413
  
Inhibitor
Name:
BDBM50295572
Synonyms:
5-(1-Hydroxy-2-isopropylamino-ethyl)-benzene-1,3-diol Alupent METAPROTERENOL Prometa [2-(3,5-Dihydroxy-phenyl)-2-hydroxy-ethyl]-isopropyl-ammonium (orciprenaline)
Type:
Small organic molecule
Emp. Form.:
C11H17NO3
Mol. Mass.:
211.2576
SMILES:
CC(C)NCC(O)c1cc(O)cc(O)c1
: