Target
Ribosomal protein S6 kinase alpha-5
Ligand
BDBM2579
Substrate
Meas. Tech.
ChEMBL_586997 (CHEMBL1037545)
Kd
42±n/a nM
Citation
 Karaman, MWHerrgard, STreiber, DKGallant, PAtteridge, CECampbell, BTChan, KWCiceri, PDavis, MIEdeen, PTFaraoni, RFloyd, MHunt, JPLockhart, DJMilanov, ZVMorrison, MJPallares, GPatel, HKPritchard, SWodicka, LMZarrinkar, PP A quantitative analysis of kinase inhibitor selectivity. Nat Biotechnol 26:127-32 (2008)  
Target
Name:
Ribosomal protein S6 kinase alpha-5
Synonyms:
90 kDa ribosomal protein S6 kinase 5 MSK1 Nuclear mitogen- and stress-activated protein kinase 1 RPS6KA5 RSK-like protein kinase Ribosomal protein S6 kinase Ribosomal protein S6 kinase alpha-5
Type:
Serine/threonine-protein kinase
Mol. Mass.:
89874.44
Organism:
Homo sapiens (Human)
Description:
Residue:
802
  
Inhibitor
Name:
BDBM2579
Synonyms:
(2S,3R,4R,6R)-3-methoxy-2-methyl-4-(methylamino)-29-oxa-1,7,17-triazaoctacyclo[12.12.2.1^{2,6}.0^{7,28}.0^{8,13}.0^{15,19}.0^{20,27}.0^{21,26}]nonacosa-8(13),9,11,14(28),15(19),20(27),21(26),22,24-nonaen-16-one Staurosporin, 4 Staurosporine, 8 US9206188, Staurosporine | US9226923, Staurosporine
Type:
Small organic molecule
Emp. Form.:
C28H26N4O3
Mol. Mass.:
466.531
SMILES:
CN[C@@H]1C[C@H]2O[C@@](C)([C@@H]1OC)n1c3ccccc3c3c4CNC(=O)c4c4c5ccccc5n2c4c13
: