Target
Serine/threonine-protein kinase 25
Ligand
BDBM17055
Substrate
Meas. Tech.
ChEMBL_586495 (CHEMBL1051263)
Kd
>10000±n/a nM
Citation
 Karaman, MWHerrgard, STreiber, DKGallant, PAtteridge, CECampbell, BTChan, KWCiceri, PDavis, MIEdeen, PTFaraoni, RFloyd, MHunt, JPLockhart, DJMilanov, ZVMorrison, MJPallares, GPatel, HKPritchard, SWodicka, LMZarrinkar, PP A quantitative analysis of kinase inhibitor selectivity. Nat Biotechnol 26:127-32 (2008)  
Target
Name:
Serine/threonine-protein kinase 25
Synonyms:
SOK1 STK25_HUMAN | YSK1
Type:
PROTEIN
Mol. Mass.:
48113.10
Organism:
Homo sapiens (Human)
Description:
ChEMBL_586495
Residue:
426
  
Inhibitor
Name:
BDBM17055
Synonyms:
(18S)-18-[(dimethylamino)methyl]-17-oxa-4,14,21-triazahexacyclo[19.6.1.1^{7,14}.0^{2,6}.0^{8,13}.0^{22,27}]nonacosa-1(28),2(6),7(29),8(13),9,11,22(27),23,25-nonaene-3,5-dione K00587a LY-333531 Ruboxistaurin | cid_153999
Type:
Small organic molecule
Emp. Form.:
C28H28N4O3
Mol. Mass.:
468.5469
SMILES:
CN(C)C[C@@H]1CCn2cc(C3=C(C(=O)NC3=O)c3cn(CCO1)c1ccccc31)c1ccccc21
: