Target
Carbonic anhydrase
Ligand
BDBM10860
Substrate
Meas. Tech.
ChEMBL_587743 (CHEMBL1038579)
Ki
82.5±n/a nM
Citation
 Bertucci, AInnocenti, AZoccola, DScozzafava, ATambutté, SSupuran, CT Carbonic anhydrase inhibitors. Inhibition studies of a coral secretory isoform by sulfonamides. Bioorg Med Chem 17:5054-8 (2009)  
Target
Name:
Carbonic anhydrase
Synonyms:
Alpha carbonic anhydrase
Type:
PROTEIN
Mol. Mass.:
36650.57
Organism:
Stylophora pistillata
Description:
ChEMBL_700658
Residue:
323
  
Inhibitor
Name:
BDBM10860
Synonyms:
4-(aminomethyl)benzene-1-sulfonamide MAFENIDE aromatic/heteroaromatic sulfonamide 5 | hCA inhibitor, 9
Type:
Small organic molecule
Emp. Form.:
C7H10N2O2S
Mol. Mass.:
186.232
SMILES:
NCc1ccc(cc1)S(N)(=O)=O
: