Target
Hepatocyte growth factor receptor
Ligand
BDBM50248510
Substrate
Meas. Tech.
ChEMBL_589179 (CHEMBL1040330)
IC50
21±n/a nM
Citation
 Mannion, MRaeppel, SClaridge, SZhou, NSaavedra, OIsakovic, LZhan, LGaudette, FRaeppel, FDéziel, RBeaulieu, NNguyen, HChute, IBeaulieu, CDupont, IRobert, MFLefebvre, SDubay, MRahil, JWang, JSte-Croix, HRobert Macleod, ABesterman, JMVaisburg, A N-(4-(6,7-Disubstituted-quinolin-4-yloxy)-3-fluorophenyl)-2-oxo-3-phenylimidazolidine-1-carboxamides: a novel series of dual c-Met/VEGFR2 receptor tyrosine kinase inhibitors. Bioorg Med Chem Lett 19:6552-6 (2009)  
Target
Name:
Hepatocyte growth factor receptor
Synonyms:
Hepatocyte growth factor receptor Hepatocyte growth factor receptor (c-MET) MET Met proto-oncogene (hepatocyte growth factor receptor) Tyrosine-protein kinase Met (c-Met) c-Met kinase
Type:
Protein
Mol. Mass.:
155559.73
Organism:
Homo sapiens (Human)
Description:
P08581
Residue:
1390
  
Inhibitor
Name:
BDBM50248510
Synonyms:
CHEMBL489326 | N-(4-(6,7-dimethoxyquinolin-4-yloxy)-3-fluorophenyl)-N-(4-fluorophenyl)cyclopropane-1,1-dicarboxamide
Type:
Small organic molecule
Emp. Form.:
C28H23F2N3O5
Mol. Mass.:
519.4961
SMILES:
COc1cc2nccc(Oc3ccc(NC(=O)C4(CC4)C(=O)Nc4ccc(F)cc4)cc3F)c2cc1OC
: