Target
Carbonic anhydrase 13
Ligand
BDBM50300204
Substrate
Meas. Tech.
ChEMBL_592893 (CHEMBL1048396)
Ki
1210±n/a nM
Citation
 Temperini, CInnocenti, AScozzafava, AParkkila, SSupuran, CT The coumarin-binding site in carbonic anhydrase accommodates structurally diverse inhibitors: the antiepileptic lacosamide as an example and lead molecule for novel classes of carbonic anhydrase inhibitors. J Med Chem 53:850-4 (2010)  
Target
Name:
Carbonic anhydrase 13
Synonyms:
CA13 Carbonic anhydrase Carbonic anhydrase XIII (CA XIII)
Type:
Enzyme
Mol. Mass.:
29445.78
Organism:
Homo sapiens (Human)
Description:
Q8N1Q1
Residue:
262
  
Inhibitor
Name:
BDBM50300204
Synonyms:
(2R)-2-acetylamino-N-benzyl-3-methoxypropanamide (R)-2-acetamido-N-benzyl-3-methoxypropanamide (R)-N-benzyl 2-acetamido-3-methoxypropionamide, Erlosamide | LACOSAMIDE
Type:
Small organic molecule
Emp. Form.:
C13H18N2O3
Mol. Mass.:
250.2936
SMILES:
COC[C@@H](NC(C)=O)C(=O)NCc1ccccc1
: