Target
P2Y purinoceptor 2
Ligand
BDBM50306712
Substrate
Meas. Tech.
ChEMBL_611631 (CHEMBL1068968)
EC50
15.9±n/a nM
Citation
 Ginsburg-Shmuel, THaas, MSchumann, MReiser, GKalid, OStern, NFischer, B 5-OMe-UDP is a potent and selective P2Y(6)-receptor agonist. J Med Chem 53:1673-85 (2010)  
Target
Name:
P2Y purinoceptor 2
Synonyms:
ATP receptor P2RY2 P2U purinoceptor 1 P2Y purinoceptor 2 Purinergic receptor | Purinergic receptor P2Y2
Type:
PROTEIN
Mol. Mass.:
42299.21
Organism:
Homo sapiens (Human)
Description:
ChEMBL_1455361
Residue:
377
  
Inhibitor
Name:
BDBM50306712
Synonyms:
((1R,2R,3S,4R,5S)-4-(2,4-dioxo-3,4-dihydropyrimidin-1(2H)-yl)-2,3-dihydroxybicyclo[3.1.0]hexan-1-yl)methyl tetrahydrogen triphosphate | CHEMBL606210
Type:
Small organic molecule
Emp. Form.:
C11H17N2O14P3
Mol. Mass.:
494.179
SMILES:
O[C@@H]1[C@H](O)[C@]2(COP(O)(=O)OP(O)(=O)OP(O)(O)=O)C[C@@H]2[C@H]1n1ccc(=O)[nH]c1=O
: