Target
Receptor-type tyrosine-protein kinase FLT3
Ligand
BDBM17015
Substrate
Meas. Tech.
ChEMBL_610308 (CHEMBL1071420)
IC50
350±n/a nM
Citation
 Mologni, LRostagno, RBrussolo, SKnowles, PPKjaer, SMurray-Rust, JRosso, EZambon, AScapozza, LMcDonald, NQLucchini, VGambacorti-Passerini, C Synthesis, structure-activity relationship and crystallographic studies of 3-substituted indolin-2-one RET inhibitors. Bioorg Med Chem 18:1482-96 (2010)  
Target
Name:
Receptor-type tyrosine-protein kinase FLT3
Synonyms:
CD135 FL cytokine receptor FLK2 FLT3 Fetal liver kinase-2 Fms-like tyrosine kinase 3 (Flt-3) STK-1 Stem cell tyrosine kinase 1
Type:
Enzyme
Mol. Mass.:
112888.62
Organism:
Homo sapiens (Human)
Description:
P36888
Residue:
993
  
Inhibitor
Name:
BDBM17015
Synonyms:
(3Z)-3-(1H-pyrrol-2-ylmethylidene)-2,3-dihydro-1H-indol-2-one Indolinone based inhibitor, 1 | Oxindole I
Type:
Small organic molecule
Emp. Form.:
C13H10N2O
Mol. Mass.:
210.2313
SMILES:
O=C1Nc2ccccc2\C1=C\c1ccc[nH]1
: