Target
5'-nucleotidase
Ligand
BDBM50268636
Substrate
Meas. Tech.
ChEMBL_612633 (CHEMBL1065670)
Ki
297±n/a nM
Citation
 Baqi, YLee, SYIqbal, JRipphausen, PLehr, AScheiff, ABZimmermann, HBajorath, JMüller, CE Development of potent and selective inhibitors of ecto-5'-nucleotidase based on an anthraquinone scaffold. J Med Chem 53:2076-86 (2010)  
Target
Name:
5'-nucleotidase
Synonyms:
5'-nucleotidase Ecto-5'-nucleotidase (e5'NT) NT Nt5e | Nte
Type:
Enzyme
Mol. Mass.:
63971.44
Organism:
Rattus norvegicus (Rat)
Description:
P21588
Residue:
576
  
Inhibitor
Name:
BDBM50268636
Synonyms:
1-amino-4-(4-aminophenylamino)-9,10-dioxo-9,10-dihydroanthracene 2-sulfonic acid sodium salt Sodium 1-Amino-4-(4-aminophenylamino)-9,10-dioxo-9,10-dihydroanthracene-2-sulfonate
Type:
Small organic molecule
Emp. Form.:
C20H14N3O5S
Mol. Mass.:
408.408
SMILES:
Nc1ccc(Nc2cc(c(N)c3C(=O)c4ccccc4C(=O)c23)S([O-])(=O)=O)cc1
: