Target
Adenosine receptor A1
Ligand
BDBM50003019
Substrate
Meas. Tech.
ChEMBL_613366 (CHEMBL1068173)
Ki
0.145000±n/a nM
Citation
 Scheiff, ABYerande, SGEl-Tayeb, ALi, WInamdar, GSVasu, KKSudarsanam, VMüller, CE 2-Amino-5-benzoyl-4-phenylthiazoles: Development of potent and selective adenosine A1 receptor antagonists. Bioorg Med Chem 18:2195-203 (2010)  
Target
Name:
Adenosine receptor A1
Synonyms:
AA1R_MOUSE Adenosine receptor A1 | Adora1
Type:
PROTEIN
Mol. Mass.:
36646.06
Organism:
Mus musculus
Description:
ChEMBL_479902
Residue:
326
  
Inhibitor
Name:
BDBM50003019
Synonyms:
8-(Hexahydro-2,5-methano-pentalen-3a-yl)-1,3-dipropyl-3,7-dihydro-purine-2,6-dione KW-3902
Type:
Small organic molecule
Emp. Form.:
C20H28N4O2
Mol. Mass.:
356.4619
SMILES:
CCCn1c2nc([nH]c2c(=O)n(CCC)c1=O)C12CC3CC1CC(C2)C3
: