Target
Sodium channel protein type 2 subunit alpha
Ligand
BDBM50031299
Substrate
Meas. Tech.
ChEMBL_622727 (CHEMBL1113103)
IC50
35000±n/a nM
Citation
 Parker, MHSmith-Swintosky, VLMcComsey, DFHuang, YBrenneman, DKlein, BMalatynska, EWhite, HSMilewski, MEHerb, MFinley, MFLiu, YLubin, MLQin, NIannucci, RLeclercq, LCuyckens, FReitz, ABMaryanoff, BE Novel, broad-spectrum anticonvulsants containing a sulfamide group: advancement of N-((benzo[b]thien-3-yl)methyl)sulfamide (JNJ-26990990) into human clinical studies. J Med Chem 52:7528-36 (2009)  
Target
Name:
Sodium channel protein type 2 subunit alpha
Synonyms:
SCN2A_RAT Scn2a1 Sodium channel protein type 2 subunit alpha Sodium channel protein type II subunit alpha Voltage-gated sodium channel | Voltage-gated sodium channel subunit alpha Nav1.2
Type:
PROTEIN
Mol. Mass.:
227854.11
Organism:
Rattus norvegicus
Description:
ChEMBL_1516893
Residue:
2005
  
Inhibitor
Name:
BDBM50031299
Synonyms:
6-(2,3-Dichloro-phenyl)-[1,2,4]triazine-3,5-diamine 6-(2,3-dichlorophenyl)-1,2,4-triazine-3,5-diamine CHEMBL741 Lamictal | Lamictal cd
Type:
Small organic molecule
Emp. Form.:
C9H7Cl2N5
Mol. Mass.:
256.091
SMILES:
Nc1nnc(c(N)n1)-c1cccc(Cl)c1Cl
: