Target
Estrogen receptor
Ligand
BDBM50311662
Substrate
Meas. Tech.
ChEMBL_618687 (CHEMBL1102465)
IC50
11000±n/a nM
Citation
 Möller, GDeluca, DGege, CRosinus, AKowalik, DPeters, ODroescher, PElger, WAdamski, JHillisch, A Structure-based design, synthesis and in vitro characterization of potent 17beta-hydroxysteroid dehydrogenase type 1 inhibitors based on 2-substitutions of estrone and D-homo-estrone. Bioorg Med Chem Lett 19:6740-4 (2009)  
Target
Name:
Estrogen receptor
Synonyms:
ER ESR ESR1_HUMAN Estrogen receptor Estrogen receptor (ER-alpha) Estrogen receptor alpha (ER) Nuclear receptor subfamily 3 group A member 1
Type:
Protein
Mol. Mass.:
66230.44
Organism:
Homo sapiens (Human)
Description:
P03372
Residue:
595
  
Inhibitor
Name:
BDBM50311662
Synonyms:
(8R,9S,13S,14S)-3-Hydroxy-2-methoxy-13-methyl-6,7,8,9,11,12,13,14,15,16-decahydro-cyclopenta[a]phenanthren-17-one 2-methoxyestrone | CHEMBL425194
Type:
Small organic molecule
Emp. Form.:
C19H24O3
Mol. Mass.:
300.3921
SMILES:
COc1cc2[C@H]3CC[C@@]4(C)[C@@H](CCC4=O)[C@@H]3CCc2cc1O
: