Target
Dihydrofolate reductase
Ligand
BDBM50366389
Substrate
Meas. Tech.
ChEMBL_623483 (CHEMBL1113554)
IC50
18000±n/a nM
Citation
 Al-Omary, FAAbou-Zeid, LANagi, MNHabib, el-SEAbdel-Aziz, AAEl-Azab, ASAbdel-Hamide, SGAl-Omar, MAAl-Obaid, AMEl-Subbagh, HI Non-classical antifolates. Part 2: synthesis, biological evaluation, and molecular modeling study of some new 2,6-substituted-quinazolin-4-ones. Bioorg Med Chem 18:2849-63 (2010)  
Target
Name:
Dihydrofolate reductase
Synonyms:
DHFR Dihydrofolate reductase (DHFR) | Tetrahydrofolate dehydrogenase
Type:
Enzyme
Mol. Mass.:
21453.99
Organism:
Homo sapiens (Human)
Description:
Recombinant human DHFR.
Residue:
187
  
Inhibitor
Name:
BDBM50366389
Synonyms:
GENTAMICIN
Type:
Small organic molecule
Emp. Form.:
C21H43N5O7
Mol. Mass.:
477.5954
SMILES:
CN[C@H](C)[C@@H]1CC[C@@H](N)[C@@H](O[C@@H]2[C@@H](N)C[C@@H](N)[C@H](O[C@H]3OC[C@](C)(O)[C@H](NC)[C@H]3O)[C@H]2O)O1
: