Target
Dihydrofolate reductase
Ligand
BDBM50316126
Substrate
Meas. Tech.
ChEMBL_623482 (CHEMBL1113553)
IC50
22000±n/a nM
Citation
 Al-Omary, FAAbou-Zeid, LANagi, MNHabib, el-SEAbdel-Aziz, AAEl-Azab, ASAbdel-Hamide, SGAl-Omar, MAAl-Obaid, AMEl-Subbagh, HI Non-classical antifolates. Part 2: synthesis, biological evaluation, and molecular modeling study of some new 2,6-substituted-quinazolin-4-ones. Bioorg Med Chem 18:2849-63 (2010)  
Target
Name:
Dihydrofolate reductase
Synonyms:
DHFR Dihydrofolate reductase | Dihydrofolate reductase (DHFR)
Type:
Enzyme
Mol. Mass.:
21603.71
Organism:
Bos taurus (Cattle)
Description:
P00376
Residue:
187
  
Inhibitor
Name:
BDBM50316126
Synonyms:
Bleph-10 Blephamide Cetamide FML-S Metimyd Ocusulf-10 Predamide SULF-10 SULFACETAMIDE Sulfacetamide, 1 Sulphacetamide Sulster Vasocidin
Type:
Small organic molecule
Emp. Form.:
C8H10N2O3S
Mol. Mass.:
214.242
SMILES:
CC(=O)NS(=O)(=O)c1ccc(N)cc1
: