Target
Kappa-type opioid receptor
Ligand
BDBM50381677
Substrate
Meas. Tech.
ChEMBL_631958 (CHEMBL1104714)
Ki
0.970000±n/a nM
Citation
 Geiger, CZelenka, CLehmkuhl, KSchepmann, DEnglberger, WWünsch, B Conformationally constrained kappa receptor agonists: stereoselective synthesis and pharmacological evaluation of 6,8-diazabicyclo[3.2.2]nonane derivatives. J Med Chem 53:4212-22 (2010)  
Target
Name:
Kappa-type opioid receptor
Synonyms:
Kappa Opioid Receptor OPRK1 Opiate Kappa 1 | mu/kappa opioid receptor
Type:
G Protein-Coupled Receptor (GPCR)
Mol. Mass.:
42744.99
Organism:
Cavia porcellus (domestic guinea pig)
Description:
P41144
Residue:
380
  
Inhibitor
Name:
BDBM50381677
Synonyms:
CHEMBL1256748 | U-69593
Type:
Small organic molecule
Emp. Form.:
C22H32N2O2
Mol. Mass.:
356.5017
SMILES:
CN([C@H]1C[C@@]2(CCCO2)CC[C@@H]1N1CCCC1)C(=O)Cc1ccccc1
: