Target
cGMP-specific 3',5'-cyclic phosphodiesterase
Ligand
BDBM50316651
Substrate
Meas. Tech.
ChEMBL_632193 (CHEMBL1106526)
IC50
0.07±n/a nM
Citation
 Tollefson, MBAcker, BAJacobsen, EJHughes, ROWalker, JKFox, DNPalmer, MJFreeman, SKYu, YBond, BR 1-(2-Ethoxyethyl)-1H-pyrazolo[4,3-d]pyrimidines as potent phosphodiesterase 5 (PDE5) inhibitors. Bioorg Med Chem Lett 20:3120-4 (2010)  
Target
Name:
cGMP-specific 3',5'-cyclic phosphodiesterase
Synonyms:
3',5'-cyclic phosphodiesterase PDE5 PDE5A_HUMAN Phosphodiesterase 5 (PDE5) Phosphodiesterase 5A (PDE5A) cGMP-specific 3',5'-cyclic phosphodiesterase
Type:
Protein
Mol. Mass.:
99975.83
Organism:
Homo sapiens (Human)
Description:
O76074
Residue:
875
  
Inhibitor
Name:
BDBM50316651
Synonyms:
1-(2-ethoxyethyl)-3-ethyl-N-phenyl-5-(piperazin-1-yl)-1H-pyrazolo[4,3-d]pyrimidin-7-amine | CHEMBL1094544
Type:
Small organic molecule
Emp. Form.:
C21H29N7O
Mol. Mass.:
395.5013
SMILES:
CCOCCn1nc(CC)c2nc(nc(Nc3ccccc3)c12)N1CCNCC1
: