Target
Cruzipain
Ligand
BDBM81467
Substrate
Meas. Tech.
ChEMBL_635149 (CHEMBL1119971)
IC50
129000±n/a nM
Citation
 Doak, AKWille, HPrusiner, SBShoichet, BK Colloid formation by drugs in simulated intestinal fluid. J Med Chem 53:4259-65 (2010)  
Target
Name:
Cruzipain
Synonyms:
CYSP_TRYCR Cruzaine | Major cysteine proteinase
Type:
Protein
Mol. Mass.:
49831.41
Organism:
Trypanosoma cruzi
Description:
P25779
Residue:
467
  
Inhibitor
Name:
BDBM81467
Synonyms:
CAS_569-65-3 Meclizine US9182402, 13
Type:
Small organic molecule
Emp. Form.:
C25H27ClN2
Mol. Mass.:
390.948
SMILES:
Cc1cccc(CN2CCN(CC2)C(c2ccccc2)c2ccc(Cl)cc2)c1
: