Target
Alpha-galactosidase
Ligand
BDBM50163440
Substrate
Meas. Tech.
ChEMBL_639828 (CHEMBL1173843)
Ki
13±n/a nM
Citation
 Pototschnig, GDe Csáky, CMBurke, JRSchitter, GStütz, AETarling, CAWithers, SGWrodnigg, TM Synthesis and biological evaluation of novel biotin-iminoalditol conjugates. Bioorg Med Chem Lett 20:4077-9 (2010)  
Target
Name:
Alpha-galactosidase
Synonyms:
α-galactosidase Alpha-galactosidase
Type:
Protein
Mol. Mass.:
41306.82
Organism:
Coffea arabica (Coffee beans)
Description:
Residue:
378
  
Inhibitor
Name:
BDBM50163440
Synonyms:
(2R,3S,4R,5S)-2-(hydroxymethyl)piperidine-3,4,5-triol 1-deoxygalactonojirimycin D-galacto-1-Deoxynojirimycin | DGJ
Type:
Small organic molecule
Emp. Form.:
C6H13NO4
Mol. Mass.:
163.1717
SMILES:
OC[C@H]1NC[C@H](O)[C@@H](O)[C@H]1O
: