Target
6-phosphogluconate dehydrogenase, decarboxylating
Ligand
BDBM50322321
Substrate
Meas. Tech.
ChEMBL_642682 (CHEMBL1176974)
Ki
66500±n/a nM
Citation
 Ruda, GFCampbell, GAlibu, VPBarrett, MPBrenk, RGilbert, IH Virtual fragment screening for novel inhibitors of 6-phosphogluconate dehydrogenase. Bioorg Med Chem 18:5056-62 (2010)  
Target
Name:
6-phosphogluconate dehydrogenase, decarboxylating
Synonyms:
6PGD_SHEEP | PGD
Type:
PROTEIN
Mol. Mass.:
52976.41
Organism:
Ovis aries
Description:
ChEMBL_642682
Residue:
483
  
Inhibitor
Name:
BDBM50322321
Synonyms:
5-phospho-D-ribonate | CHEMBL1173785
Type:
Small organic molecule
Emp. Form.:
C5H11O9P
Mol. Mass.:
246.1092
SMILES:
O[C@@H](COP(O)(O)=O)[C@H](O)[C@H](O)C(O)=O
: