Target
Carbonic anhydrase 1
Ligand
BDBM50325274
Substrate
Meas. Tech.
ChEMBL_651943 (CHEMBL1227473)
Ki
1920±n/a nM
Citation
 Innocenti, AGülçin, IScozzafava, ASupuran, CT Carbonic anhydrase inhibitors. Antioxidant polyphenols effectively inhibit mammalian isoforms I-XV. Bioorg Med Chem Lett 20:5050-3 (2010)  
Target
Name:
Carbonic anhydrase 1
Synonyms:
CA-I CAB Carbonate dehydratase I Carbonic anhydrase 1 (CA I) Carbonic anhydrase 1 (Recombinant CA I) Carbonic anhydrase B Carbonic anhydrase I (CA I) Carbonic anhydrase I (CAI) Carbonic anhydrase isoenzyme I (hCA I) | hCA
Type:
Enzyme
Mol. Mass.:
28873.37
Organism:
Homo sapiens (Human)
Description:
P00915
Residue:
261
  
Inhibitor
Name:
BDBM50325274
Synonyms:
4-{2-[3-(4-Hydroxy-phenyl)-1-methyl-propylamino]-ethyl}-benzene-1,2-diol CHEMBL926 Dobutrex | cid_36811
Type:
Small organic molecule
Emp. Form.:
C18H23NO3
Mol. Mass.:
301.3801
SMILES:
CC(CCc1ccc(O)cc1)NCCc1ccc(O)c(O)c1
: