Target
Carbonic anhydrase 15
Ligand
BDBM26187
Substrate
Meas. Tech.
ChEMBL_651955 (CHEMBL1227628)
Ki
10500±n/a nM
Citation
 Innocenti, AGülçin, IScozzafava, ASupuran, CT Carbonic anhydrase inhibitors. Antioxidant polyphenols effectively inhibit mammalian isoforms I-XV. Bioorg Med Chem Lett 20:5050-3 (2010)  
Target
Name:
Carbonic anhydrase 15
Synonyms:
CAH15_MOUSE Car15
Type:
PROTEIN
Mol. Mass.:
35484.02
Organism:
Mus musculus
Description:
ChEMBL_651955
Residue:
324
  
Inhibitor
Name:
BDBM26187
Synonyms:
α-CA inhibitor, 11 US9688816, 2 | phenol
Type:
Small organic molecule
Emp. Form.:
C6H6O
Mol. Mass.:
94.1112
SMILES:
Oc1ccccc1
: