Target
Maltase-glucoamylase
Ligand
BDBM50330957
Substrate
Meas. Tech.
ChEMBL_684093 (CHEMBL1286470)
Ki
1400±n/a nM
Citation
 Mohan, SSim, LRose, DRPinto, BM Probing the active-site requirements of human intestinal N-terminal maltase-glucoamylase: Synthesis and enzyme inhibitory activities of a six-membered ring nitrogen analogue of kotalanol and its de-O-sulfonated derivative. Bioorg Med Chem 18:7794-8 (2010)  
Target
Name:
Maltase-glucoamylase
Synonyms:
Alpha glucosidase MGA MGAML Maltase | Maltase-glucoamylase, intestinal
Type:
Enzyme
Mol. Mass.:
209817.06
Organism:
Homo sapiens (Human)
Description:
O43451
Residue:
1857
  
Inhibitor
Name:
BDBM50330957
Synonyms:
7'-[(1,5-Dideoxy-1,5-imino-D-glucitol)-5-N-ammonium]-7'-deoxy-D-perseitol chloride | CHEMBL1277063
Type:
Small organic molecule
Emp. Form.:
C13H27NO10
Mol. Mass.:
357.3542
SMILES:
OC[C@H](O)[C@@H](O)[C@@H](O)[C@H](O)[C@H](O)CN1C[C@H](O)[C@@H](O)[C@H](O)[C@H]1CO
: