Target
Androgen receptor
Ligand
BDBM18525
Substrate
Meas. Tech.
ChEMBL_687028 (CHEMBL1291499)
IC50
200±n/a nM
Citation
 Yoshino, HSato, HShiraishi, TTachibana, KEmura, THonma, AIshikura, NTsunenari, TWatanabe, MNishimoto, ANakamura, RNakagawa, TOhta, MTakata, NFurumoto, KKimura, KKawata, H Design and synthesis of an androgen receptor pure antagonist (CH5137291) for the treatment of castration-resistant prostate cancer. Bioorg Med Chem 18:8150-7 (2010)  
Target
Name:
Androgen receptor
Synonyms:
ANDR_HUMAN Androgen Receptor Androgen receptor/Baculoviral IAP repeat-containing protein 2 Dihydrotestosterone receptor Nuclear receptor subfamily 3 group C member 4
Type:
Receptor
Mol. Mass.:
99185.27
Organism:
Homo sapiens (Human)
Description:
CHO cells were stably transfected with human AR gene.
Residue:
920
  
Inhibitor
Name:
BDBM18525
Synonyms:
Bicalutamide N-[4-cyano-3-(trifluoromethyl)phenyl]-3-[(4-fluorobenzene)sulfonyl]-2-hydroxy-2-methylpropanamide US20230382870, Bicalutumide US9682960, CAS
Type:
Small organic molecule
Emp. Form.:
C18H14F4N2O4S
Mol. Mass.:
430.373
SMILES:
CC(O)(CS(=O)(=O)c1ccc(F)cc1)C(=O)Nc1ccc(C#N)c(c1)C(F)(F)F
: