Target
Tyrosine-protein kinase JAK1
Ligand
BDBM6866
Substrate
Meas. Tech.
ChEMBL_686114 (CHEMBL1292870)
Kd
21±n/a nM
Citation
 Malerich, JPLam, JSHart, BFine, RMKlebansky, BTanga, MJD'Andrea, A Diamino-1,2,4-triazole derivatives are selective inhibitors of TYK2 and JAK1 over JAK2 and JAK3. Bioorg Med Chem Lett 20:7454-7 (2010)  
Target
Name:
Tyrosine-protein kinase JAK1
Synonyms:
JAK-1 JAK1A JAK1_HUMAN Janus kinase 1 (JAK1) | Janus kinase 1 JAK1
Type:
Protein
Mol. Mass.:
133293.73
Organism:
Homo sapiens (Human)
Description:
P23458
Residue:
1154
  
Inhibitor
Name:
BDBM6866
Synonyms:
1-Acyl-1H-[1,2,4]triazole-3,5-diamine Analogue 3b 4-[[5-Amino-1-(2,6-difluorobenzoyl)-1H-1,2,4-triazol-3-yl]amino]-benzenesulfonamide JNJ-7706621 | cid_5330790
Type:
Small organic molecule
Emp. Form.:
C15H12F2N6O3S
Mol. Mass.:
394.356
SMILES:
Nc1nc(Nc2ccc(cc2)S(N)(=O)=O)nn1C(=O)c1c(F)cccc1F
: