Target
Carbonic anhydrase 9
Ligand
BDBM26979
Substrate
Meas. Tech.
ChEMBL_700696 (CHEMBL1645735)
Ki
33000000±n/a nM
Citation
 Ekinci, DCeyhun, SBSentürk, MErdem, DKüfrevioglu, OISupuran, CT Characterization and anions inhibition studies of ana-carbonic anhydrase from the teleost fish Dicentrarchus labrax. Bioorg Med Chem 19:744-8 (2011)  
Target
Name:
Carbonic anhydrase 9
Synonyms:
CA-IX CAH9_HUMAN Carbonic anhydrase 9 (CA IX) Carbonic anhydrase 9 precursor Carbonic anhydrase IX (CAIX) Carbonic anhydrases; II & IX MN RCC-associated antigen G250
Type:
Enzyme
Mol. Mass.:
49669.03
Organism:
Homo sapiens (Human)
Description:
Catalytic domain of human cloned isozyme was used in the assay
Residue:
459
  
Inhibitor
Name:
BDBM26979
Synonyms:
CHEMBL69710 POTASSIUM CHLORIDE chloride | chloride ion
Type:
Ion
Emp. Form.:
Cl
Mol. Mass.:
35.454
SMILES:
[Cl-]
: