Target
Tyrosine-protein kinase JAK2
Ligand
BDBM50335209
Substrate
Meas. Tech.
ChEMBL_701697 (CHEMBL1656589)
IC50
8±n/a nM
Citation
 Ioannidis, SLamb, MLWang, TAlmeida, LBlock, MHDavies, AMPeng, BSu, MZhang, HJHoffmann, ERivard, CGreen, IHoward, TPollard, HRead, JAlimzhanov, MBebernitz, GBell, KYe, MHuszar, DZinda, M Discovery of 5-chloro-N2-[(1S)-1-(5-fluoropyrimidin-2-yl)ethyl]-N4-(5-methyl-1H-pyrazol-3-yl)pyrimidine-2,4-diamine (AZD1480) as a novel inhibitor of the Jak/Stat pathway. J Med Chem 54:262-76 (2011)  
Target
Name:
Tyrosine-protein kinase JAK2
Synonyms:
JAK-2 JAK2_HUMAN Janus kinase 2 (JAK2) | Janus kinase 2 (a protein tyrosine kinase)
Type:
Protein
Mol. Mass.:
130684.68
Organism:
Homo sapiens (Human)
Description:
O60674
Residue:
1132
  
Inhibitor
Name:
BDBM50335209
Synonyms:
5-fluoro-N2-[(1S)-1-(5-fluoropyrimidin-2-yl)ethyl]-N4-(5-methoxy-1H-pyrazol-3-yl)-6-morpholin-4-ylpyrimidine-2,4-diamine | CHEMBL1650736
Type:
Small organic molecule
Emp. Form.:
C18H21F2N9O2
Mol. Mass.:
433.4152
SMILES:
COc1cc(Nc2nc(N[C@@H](C)c3ncc(F)cn3)nc(N3CCOCC3)c2F)[nH]n1
: