Target
Procathepsin L
Ligand
BDBM50335276
Substrate
Meas. Tech.
ChEMBL_702782 (CHEMBL1655225)
Ki
1.5±n/a nM
Citation
 Frizler, MLohr, FFurtmann, NKläs, JGütschow, M Structural optimization of azadipeptide nitriles strongly increases association rates and allows the development of selective cathepsin inhibitors. J Med Chem 54:396-400 (2011)  
Target
Name:
Procathepsin L
Synonyms:
CATL1_HUMAN CTSL CTSL1 Cathepsin L Cathepsin L1 heavy chain MEP cathepsin L preproprotein
Type:
Enzyme
Mol. Mass.:
37557.19
Organism:
Homo sapiens (Human)
Description:
Purchased from Calbiochem (San Diego, CA).
Residue:
333
  
Inhibitor
Name:
BDBM50335276
Synonyms:
CHEMBL1651242 | N-(Benzyloxycarbonyl)-valyl-methylazalanine-nitrile
Type:
Small organic molecule
Emp. Form.:
C16H22N4O3
Mol. Mass.:
318.3709
SMILES:
CC(C)[C@H](NC(=O)OCc1ccccc1)C(=O)N(C)N(C)C#N
: