Target
Adenosine receptor A2a
Ligand
BDBM50336715
Substrate
Meas. Tech.
ChEMBL_718204 (CHEMBL1679250)
Ki
5.9±n/a nM
Citation
 Sams, AGMikkelsen, GKLarsen, MLanggård, MHowells, MESchrøder, TJBrennum, LTTorup, LJørgensen, EBBundgaard, CKreilgård, MBang-Andersen, B Discovery of phosphoric acid mono-{2-[(E/Z)-4-(3,3-dimethyl-butyrylamino)-3,5-difluoro-benzoylimino]-thiazol-3-ylmethyl} ester (Lu AA47070): a phosphonooxymethylene prodrug of a potent and selective hA(2A) receptor antagonist. J Med Chem 54:751-64 (2012)  
Target
Name:
Adenosine receptor A2a
Synonyms:
A2A adenosine receptor (hA2A) ADENOSINE A2 ADORA2 Adenosine A2A receptor (A2AAR)
Type:
G Protein-Coupled Receptor (GPCR)
Mol. Mass.:
44716.46
Organism:
Homo sapiens (Human)
Description:
P29274
Residue:
412
  
Inhibitor
Name:
BDBM50336715
Synonyms:
4-(3,3-Dimethyl-butyrylamino)-3,5-difluoro-N-thiazol-2-yl-benzamide | CHEMBL1671936
Type:
Small organic molecule
Emp. Form.:
C16H17F2N3O2S
Mol. Mass.:
353.387
SMILES:
CC(C)(C)CC(=O)Nc1c(F)cc(cc1F)C(=O)Nc1nccs1
: