Target
D(2) dopamine receptor
Ligand
BDBM50010692
Substrate
Meas. Tech.
ChEMBL_718436 (CHEMBL1680100)
Ki
810±n/a nM
Citation
 Sromek, AWSi, YGZhang, TGeorge, SRSeeman, PNeumeyer, JL Synthesis and Biological Evaluation of N-Fluoroalkyl and 2-Fluoroalkoxy Substituted Aporphines: Potential PET Ligands for Dopamine D(2) Receptors. ACS Med Chem Lett 2:189-194 (2011)  
Target
Name:
D(2) dopamine receptor
Synonyms:
DOPAMINE D2 DOPAMINE D2 Short Dopamine D2 receptor Drd2
Type:
G Protein-Coupled Receptor (GPCR)
Mol. Mass.:
50931.60
Organism:
Rattus norvegicus (rat)
Description:
P61169
Residue:
444
  
Inhibitor
Name:
BDBM50010692
Synonyms:
(R)-(-)-2-methoxy-N-npropylnorapomorphine 2-Methoxy-6-propyl-5,6,6a,7-tetrahydro-4H-dibenzo[de,g]quinoline-10,11-diol | CHEMBL53294
Type:
Small organic molecule
Emp. Form.:
C20H23NO3
Mol. Mass.:
325.4015
SMILES:
CCCN1CCc2cc(OC)cc-3c2[C@H]1Cc1ccc(O)c(O)c-31
: