Target
Solute carrier family 15 member 2
Ligand
BDBM50350473
Substrate
Meas. Tech.
ChEMBL_762551 (CHEMBL1817008)
Ki
8500000±n/a nM
Citation
 Pedretti, ADe Luca, LMarconi, CRegazzoni, LAldini, GVistoli, G Fragmental modeling of hPepT2 and analysis of its binding features by docking studies and pharmacophore mapping. Bioorg Med Chem 19:4544-51 (2011)  
Target
Name:
Solute carrier family 15 member 2
Synonyms:
Kidney H(+)/peptide cotransporter PEPT2 S15A2_HUMAN | SLC15A2
Type:
PROTEIN
Mol. Mass.:
81795.62
Organism:
Homo sapiens (Human)
Description:
ChEMBL_762551
Residue:
729
  
Inhibitor
Name:
BDBM50350473
Synonyms:
Aliporina | CEFALORIDINE
Type:
Small organic molecule
Emp. Form.:
C19H17N3O4S2
Mol. Mass.:
415.486
SMILES:
[O-]C(=O)C1=C(C[n+]2ccccc2)CS[C@@H]2[C@@H](NC(=O)Cc3cccs3)C(=O)N12
: