Target
C-C chemokine receptor type 5
Ligand
BDBM50334986
Substrate
Meas. Tech.
ChEMBL_809510 (CHEMBL2015427)
Kd
25±n/a nM
Citation
 Navratilova, IBesnard, JHopkins, AL Screening for GPCR Ligands Using Surface Plasmon Resonance. ACS Med Chem Lett 2:549-554 (2011)  
Target
Name:
C-C chemokine receptor type 5
Synonyms:
C-C CKR-5 CC-CKR-5 CCR5 CCR5_HUMAN CHEMR13 HIV-1 fusion coreceptor
Type:
Enzyme
Mol. Mass.:
40540.21
Organism:
Homo sapiens (Human)
Description:
P51681
Residue:
352
  
Inhibitor
Name:
BDBM50334986
Synonyms:
4,4-Difluoro-cyclohexanecarboxylic acid {(S)-3-[(1S,5S)-3-(3-isopropyl-5-methyl-[1,2,4]triazol-4-yl)-8-aza-bicyclo[3.2.1]oct-8-yl]-1-phenyl-propyl}-amide 4,4-difluoro-N-((S)-3-((1S,3S,5R)-3-(3-isopropyl-5-methyl-4H-1,2,4-triazol-4-yl)-8-aza-bicyclo[3.2.1]octan-8-yl)-1-phenylpropyl)cyclohexanecarboxamide CHEMBL1201187 Selzentry | UK-427857
Type:
Small organic molecule
Emp. Form.:
C29H41F2N5O
Mol. Mass.:
513.6655
SMILES:
CC(C)c1nnc(C)n1[C@H]1C[C@@H]2CC[C@H](C1)N2CC[C@H](NC(=O)C1CCC(F)(F)CC1)c1ccccc1
: