Target
Serine/threonine-protein kinase Chk1
Ligand
BDBM50243258
Substrate
Meas. Tech.
ChEMBL_811468 (CHEMBL2013769)
IC50
7±n/a nM
Citation
 Oza, VAshwell, SBrassil, PBreed, JEzhuthachan, JDeng, CGrondine, MHorn, CLiu, DLyne, PNewcombe, NPass, MRead, JSu, MToader, DYu, DYu, YZabludoff, S Synthesis and evaluation of triazolones as checkpoint kinase 1 inhibitors. Bioorg Med Chem Lett 22:2330-7 (2012)  
Target
Name:
Serine/threonine-protein kinase Chk1
Synonyms:
CHEK1 CHK1 checkpoint homolog Checkpoint kinase-1 (CHK1)
Type:
Enzyme Catalytic Domain
Mol. Mass.:
54443.02
Organism:
Homo sapiens (Human)
Description:
gi_166295192
Residue:
476
  
Inhibitor
Name:
BDBM50243258
Synonyms:
(S)-1-(5-phenyl-3-(piperidin-3-ylcarbamoyl)thiophen-2-yl)urea | CHEMBL487273
Type:
Small organic molecule
Emp. Form.:
C17H20N4O2S
Mol. Mass.:
344.431
SMILES:
NC(=O)Nc1sc(cc1C(=O)N[C@H]1CCCNC1)-c1ccccc1
: