Target
Serine/threonine-protein kinase Chk1
Ligand
BDBM50325177
Substrate
Meas. Tech.
ChEMBL_811468 (CHEMBL2013769)
IC50
0.100000±n/a nM
Citation
 Oza, VAshwell, SBrassil, PBreed, JEzhuthachan, JDeng, CGrondine, MHorn, CLiu, DLyne, PNewcombe, NPass, MRead, JSu, MToader, DYu, DYu, YZabludoff, S Synthesis and evaluation of triazolones as checkpoint kinase 1 inhibitors. Bioorg Med Chem Lett 22:2330-7 (2012)  
Target
Name:
Serine/threonine-protein kinase Chk1
Synonyms:
CHEK1 CHK1 checkpoint homolog Checkpoint kinase-1 (CHK1)
Type:
Enzyme Catalytic Domain
Mol. Mass.:
54443.02
Organism:
Homo sapiens (Human)
Description:
gi_166295192
Residue:
476
  
Inhibitor
Name:
BDBM50325177
Synonyms:
5-methyl-8-(1H-pyrrol-2-yl)-[1,2,4]triazolo[4,3-a]quinolin-1(2H)-one | CHEMBL1223526
Type:
Small organic molecule
Emp. Form.:
C15H12N4O
Mol. Mass.:
264.282
SMILES:
Cc1cc2n[nH]c(=O)n2c2cc(ccc12)-c1ccc[nH]1
: