Target
Steryl-sulfatase
Ligand
BDBM50380216
Substrate
Meas. Tech.
ChEMBL_811917 (CHEMBL2013287)
IC50
0.11±n/a nM
Citation
 Lawrence Woo, LWLeblond, BPurohit, APotter, BV Synthesis and evaluation of analogues of estrone-3-O-sulfamate as potent steroid sulfatase inhibitors. Bioorg Med Chem 20:2506-19 (2012)  
Target
Name:
Steryl-sulfatase
Synonyms:
ARSC1 Arylsulfatase C STS_HUMAN Steryl-sulfate sulfohydrolase
Type:
Enzyme
Mol. Mass.:
65503.66
Organism:
Homo sapiens (Human)
Description:
P08842
Residue:
583
  
Inhibitor
Name:
BDBM50380216
Synonyms:
CHEMBL364332
Type:
Small organic molecule
Emp. Form.:
C18H22BrNO4S
Mol. Mass.:
428.341
SMILES:
C[C@]12CC[C@H]3[C@@H](CCc4cc(OS(N)(=O)=O)c(Br)cc34)[C@@H]1CCC2=O
: