Target
Fructose-bisphosphate aldolase A
Ligand
BDBM50380325
Substrate
Meas. Tech.
ChEMBL_813854 (CHEMBL2020223)
IC50
157000±n/a nM
Citation
 Mabiala-Bassiloua, CGArthus-Cartier, GHannaert, VThérisod, HSygusch, JThérisod, M Mannitol Bis-phosphate Based Inhibitors of Fructose 1,6-Bisphosphate Aldolases. ACS Med Chem Lett 2:804-808 (2011)  
Target
Name:
Fructose-bisphosphate aldolase A
Synonyms:
ALDOA | ALDOA_RABIT
Type:
PROTEIN
Mol. Mass.:
39351.00
Organism:
Oryctolagus cuniculus
Description:
ChEMBL_813854
Residue:
364
  
Inhibitor
Name:
BDBM50380325
Synonyms:
CHEMBL2017787
Type:
Small organic molecule
Emp. Form.:
C11H26O12P2
Mol. Mass.:
412.2645
SMILES:
CCCCCO[C@H](COP(O)(O)=O)[C@@H](O)[C@H](O)[C@H](O)COP(O)(O)=O
: