Target
Cytochrome P450 2C19
Ligand
BDBM50380515
Substrate
Meas. Tech.
ChEMBL_813102 (CHEMBL2020721)
IC50
50±n/a nM
Citation
 Foti, RSRock, DAHan, XFlowers, RAWienkers, LCWahlstrom, JL Ligand-based design of a potent and selective inhibitor of cytochrome P450 2C19. J Med Chem 55:1205-14 (2012)  
Target
Name:
Cytochrome P450 2C19
Synonyms:
CP2CJ_HUMAN CYPIIC17 Cytochrome P450 2C19 (CYP2C19) Mephenytoin 4-hydroxylase P450-254C
Type:
Enzyme
Mol. Mass.:
55935.47
Organism:
Homo sapiens (Human)
Description:
P33261
Residue:
490
  
Inhibitor
Name:
BDBM50380515
Synonyms:
CHEMBL2019024
Type:
Small organic molecule
Emp. Form.:
C14H13N3S
Mol. Mass.:
255.338
SMILES:
Cc1ccc2nc(SCc3ccccn3)[nH]c2c1
: