Target
Cholinesterase
Ligand
BDBM50380542
Substrate
Meas. Tech.
ChEMBL_813114 (CHEMBL2020733)
IC50
0.10±n/a nM
Citation
 Fernández-Bachiller, MIPérez, CMonjas, LRademann, JRodríguez-Franco, MI New tacrine-4-oxo-4H-chromene hybrids as multifunctional agents for the treatment of Alzheimer's disease, with cholinergic, antioxidant, andß-amyloid-reducing properties. J Med Chem 55:1303-17 (2012)  
Target
Name:
Cholinesterase
Synonyms:
Acylcholine acylhydrolase Butyrylcholine esterase (BChE) Butyrylcholinesterase (BuChE) CHLE_HUMAN Cholinesterases Pseudocholinesterase
Type:
Homotetramer
Mol. Mass.:
68422.27
Organism:
Homo sapiens (Human)
Description:
P06276
Residue:
602
  
Inhibitor
Name:
BDBM50380542
Synonyms:
CHEMBL2019037
Type:
Small organic molecule
Emp. Form.:
C35H43N3O5
Mol. Mass.:
585.733
SMILES:
COc1cc(OC)c2c(c1)oc(cc2=O)C(=O)NCCCCCCCCCCNc1c2CCCCc2nc2ccccc12
: