Target
Cholecystokinin receptor type A
Ligand
BDBM50380725
Substrate
Meas. Tech.
ChEMBL_813376 (CHEMBL2019603)
IC50
9.9±n/a nM
Citation
 Cameron, KOBeretta, EEChen, YChu-Moyer, MFernando, DGao, HKohrt, JLavergne, SJardine, Pda SGuzman-Perez, AHoth, CPerry, DAHadcock, JRGautreau, DMakowski, MPerez, SPolivkova, JRogers, LScott, DOSwick, AGThiede, LTrebino, CETrilles, RVWilmowski, JZhang, Y Discovery of new piperidine amide triazolobenzodiazepinones as intestinal-selective CCK1 receptor agonists. Bioorg Med Chem Lett 22:2943-7 (2012)  
Target
Name:
Cholecystokinin receptor type A
Synonyms:
CCK-A receptor CCK1-R CCKAR_HUMAN Cholecystokinin receptor Cholecystokinin-1 Receptor
Type:
G Protein-Coupled Receptor (GPCR)
Mol. Mass.:
47859.34
Organism:
Homo sapiens (Human)
Description:
Stable expression of human CCK-1 receptors in HEK 293 cells.
Residue:
428
  
Inhibitor
Name:
BDBM50380725
Synonyms:
CHEMBL2017832
Type:
Small organic molecule
Emp. Form.:
C34H35N7O3
Mol. Mass.:
589.6868
SMILES:
COCCC1CCCCN1C(=O)CN1c2ccccc2-n2c(nnc2-c2ccccc2)[C@H](Cc2n[nH]c3ccccc23)C1=O
: