Target
Calcitonin gene-related peptide type 1 receptor
Ligand
BDBM50380831
Substrate
Meas. Tech.
ChEMBL_813801 (CHEMBL2020109)
IC50
0.15±n/a nM
Citation
 Luo, GChen, LPin, SSXu, CConway, CMMacor, JEDubowchik, GM Calcitonin gene-related peptide (CGRP) receptor antagonists: novel aspartates and succinates. Bioorg Med Chem Lett 22:2912-6 (2012)  
Target
Name:
Calcitonin gene-related peptide type 1 receptor
Synonyms:
Adrenomedullin receptor AM1; CALCRL/RAMP2 CALRL_HUMAN CGRP type 1 receptor mRNA Calcitonin gene-related peptide (CGRP) receptor Calcitonin receptor-like receptor Human CL receptor
Type:
Enzyme Catalytic Domain
Mol. Mass.:
52980.45
Organism:
Homo sapiens (Human)
Description:
Q16602
Residue:
461
  
Inhibitor
Name:
BDBM50380831
Synonyms:
CHEMBL2018507
Type:
Small organic molecule
Emp. Form.:
C37H47N7O3
Mol. Mass.:
637.8142
SMILES:
Cc1cc(CC(CC(=O)N2CCC(CC2)n2cc([nH]c2=O)-c2ccccc2)C(=O)N2CCC(CC2)N2CCCCC2)cc2cn[nH]c12
: