Target
17-beta-hydroxysteroid dehydrogenase type 3
Ligand
BDBM50381590
Substrate
Meas. Tech.
ChEMBL_814690 (CHEMBL2021209)
IC50
4±n/a nM
Citation
 Harada, KKubo, HAbe, JHaneta, MConception, AInoue, SOkada, SNishioka, K Discovery of potent and orally bioavailable 17ß-hydroxysteroid dehydrogenase type 3 inhibitors. Bioorg Med Chem 20:3242-54 (2012)  
Target
Name:
17-beta-hydroxysteroid dehydrogenase type 3
Synonyms:
17-beta-hydroxysteroid dehydrogenase type 3 EDH17B3 HSD17B3 | SDR12C2
Type:
Enzyme
Mol. Mass.:
34525.39
Organism:
Homo sapiens (Human)
Description:
P37058
Residue:
310
  
Inhibitor
Name:
BDBM50381590
Synonyms:
CHEMBL2018242
Type:
Small organic molecule
Emp. Form.:
C17H14BrN3O4
Mol. Mass.:
404.215
SMILES:
CN(C)c1ccc(cn1)N1C(=O)O\C(=C/c2ccc(O)c(Br)c2)C1=O
: