Target
Muscarinic acetylcholine receptor M1
Ligand
BDBM50381654
Substrate
Meas. Tech.
ChEMBL_815845 (CHEMBL2026108)
Ki
0.12±n/a nM
Citation
 Lainé, DIYan, HXie, HDavis, RSDufour, JWiddowson, KLPalovich, MRWan, ZFoley, JJSchmidt, DBHunsberger, GEBurman, MBacon, AMWebb, EFLuttmann, MASalmon, MSarau, HMUmbrecht, STLandis, PSPeck, BJBusch-Petersen, J Design, synthesis and structure-activity relationship of N-substituted tropane muscarinic acetylcholine receptor antagonists. Bioorg Med Chem Lett 22:3366-9 (2012)  
Target
Name:
Muscarinic acetylcholine receptor M1
Synonyms:
ACM1_HUMAN Cholinergic receptor, muscarinic 1 | Cholinergic, muscarinic M1
Type:
Protein
Mol. Mass.:
51442.54
Organism:
Homo sapiens (Human)
Description:
P11229
Residue:
460
  
Inhibitor
Name:
BDBM50381654
Synonyms:
CHEMBL2023764
Type:
Small organic molecule
Emp. Form.:
C29H37N2
Mol. Mass.:
413.6169
SMILES:
C[N@+]1(CCCCC=C)C2CCC1C[C@@H](CC(C#N)(c1ccccc1)c1ccccc1)C2
: