Target
Prostaglandin G/H synthase 2
Ligand
BDBM50174201
Substrate
Meas. Tech.
ChEMBL_815720 (CHEMBL2025720)
IC50
3100±n/a nM
Citation
 El-Sayed, MAAbdel-Aziz, NIAbdel-Aziz, AAEl-Azab, ASElTahir, KE Synthesis, biological evaluation and molecular modeling study of pyrazole and pyrazoline derivatives as selective COX-2 inhibitors and anti-inflammatory agents. Part 2. Bioorg Med Chem 20:3306-16 (2012)  
Target
Name:
Prostaglandin G/H synthase 2
Synonyms:
COX2 Cyclooxygenase-2 (COX-2) PTGS2 Prostaglandin G/H synthase (cyclooxygenase)
Type:
Protein
Mol. Mass.:
68976.98
Organism:
Ovis aries (Sheep)
Description:
Residue:
603
  
Inhibitor
Name:
BDBM50174201
Synonyms:
ARTHROTEC SOLARAZE US11173137, Compound Diclofenac VOLTAREN-XR sodium 2-(2-(2,6-dichlorophenylamino)phenyl)acetate
Type:
Small organic molecule
Emp. Form.:
C14H10Cl2NO2
Mol. Mass.:
295.141
SMILES:
[O-]C(=O)Cc1ccccc1Nc1c(Cl)cccc1Cl
: