Target
Calcitonin gene-related peptide type 1 receptor
Ligand
BDBM50382779
Substrate
Meas. Tech.
ChEMBL_815265 (CHEMBL2025456)
IC50
0.1±n/a nM
Citation
 Luo, GChen, LCiviello, RPin, SSXu, CKostich, WKelley, MConway, CMMacor, JEDubowchik, GM Calcitonin gene-related peptide (CGRP) receptor antagonists: pyridine as a replacement for a core amide group. Bioorg Med Chem Lett 22:2917-21 (2012)  
Target
Name:
Calcitonin gene-related peptide type 1 receptor
Synonyms:
Adrenomedullin receptor AM1; CALCRL/RAMP2 CALRL_HUMAN CGRP type 1 receptor mRNA Calcitonin gene-related peptide (CGRP) receptor Calcitonin receptor-like receptor Human CL receptor
Type:
Enzyme Catalytic Domain
Mol. Mass.:
52980.45
Organism:
Homo sapiens (Human)
Description:
Q16602
Residue:
461
  
Inhibitor
Name:
BDBM50382779
Synonyms:
CHEMBL2022601
Type:
Small organic molecule
Emp. Form.:
C35H41N7O3
Mol. Mass.:
607.7451
SMILES:
Cc1cc(CC(OC(=O)N2CCC(CC2)N2Cc3ccccc3NC2=O)c2cc(CN3CCCCC3)ccn2)cc2cn[nH]c12
: