Target
Glycogen phosphorylase, muscle form
Ligand
BDBM50263768
Substrate
Meas. Tech.
ChEMBL_818388 (CHEMBL2034615)
IC50
3100±n/a nM
Citation
 Krimm, ILancelin, JMPraly, JP Binding evaluation of fragment-based scaffolds for probing allosteric enzymes. J Med Chem 55:1287-95 (2012)  
Target
Name:
Glycogen phosphorylase, muscle form
Synonyms:
Glycogen Phosphorylase (PYGM) Glycogen phosphorylase, muscle form PYGM | PYGM_RABIT
Type:
Enzyme
Mol. Mass.:
97296.32
Organism:
Oryctolagus cuniculus (rabbit)
Description:
Phosphorylation of Ser-15 converts phosphorylase B (unphosphorylated) to phosphorylase A.
Residue:
843
  
Inhibitor
Name:
BDBM50263768
Synonyms:
(5S,7R,8S,9S,10R)-8,9,10-Trihydroxy-7-hydroxymethyl-6-oxa-1,3-diaza-spiro[4.5]decane-2,4-dione BETA-D-GLUCOPYRANOSE SPIROHYDANTOIN | CHEMBL510975
Type:
Small organic molecule
Emp. Form.:
C8H12N2O7
Mol. Mass.:
248.1901
SMILES:
OC[C@H]1O[C@@]2(NC(=O)NC2=O)[C@H](O)[C@@H](O)[C@@H]1O
: