Target
Cell division cycle 7-related protein kinase
Ligand
BDBM50383739
Substrate
Meas. Tech.
ChEMBL_819140 (CHEMBL2034660)
IC50
4±n/a nM
Citation
 Koltun, ESTsuhako, ALBrown, DSAay, NArcalas, AChan, VDu, HEngst, SFerguson, KFranzini, MGalan, AHolst, CRHuang, PKane, BKim, MHLi, JMarkby, DMohan, MNoson, KPlonowski, ARichards, SJRobertson, SShaw, KStott, GStout, TJYoung, JYu, PZaharia, CAZhang, WZhou, PNuss, JMXu, WKearney, PC Discovery of XL413, a potent and selective CDC7 inhibitor. Bioorg Med Chem Lett 22:3727-31 (2012)  
Target
Name:
Cell division cycle 7-related protein kinase
Synonyms:
CDC7 CDC7L1 Cell division cycle 7-related protein kinase (CDC7) huCdc7
Type:
Protein
Mol. Mass.:
63908.16
Organism:
Homo sapiens (Human)
Description:
O00311
Residue:
574
  
Inhibitor
Name:
BDBM50383739
Synonyms:
CHEMBL2030404
Type:
Small organic molecule
Emp. Form.:
C14H11ClFN3O2
Mol. Mass.:
307.707
SMILES:
F[C@H]1CN[C@@H](C1)c1nc2c3cc(Cl)ccc3oc2c(=O)[nH]1
: