Target
Tyrosine-protein kinase receptor UFO
Ligand
BDBM50384585
Substrate
Meas. Tech.
ChEMBL_820660 (CHEMBL2037931)
IC50
16±n/a nM
Citation
 Liu, JYang, CSimpson, CDeryckere, DVan Deusen, AMiley, MJKireev, DNorris-Drouin, JSather, SHunter, DKorboukh, VKPatel, HSJanzen, WPMachius, MJohnson, GLEarp, HSGraham, DKFrye, SVWang, X Discovery of Novel Small Molecule Mer Kinase Inhibitors for the Treatment of Pediatric Acute Lymphoblastic Leukemia. ACS Med Chem Lett 3:129-134 (2012)  
Target
Name:
Tyrosine-protein kinase receptor UFO
Synonyms:
AXL TEL/AXL UFO | UFO_HUMAN
Type:
Enzyme
Mol. Mass.:
98316.97
Organism:
Homo sapiens (Human)
Description:
P30530
Residue:
894
  
Inhibitor
Name:
BDBM50384585
Synonyms:
CHEMBL2036809
Type:
Small organic molecule
Emp. Form.:
C27H31FN6
Mol. Mass.:
458.5736
SMILES:
N[C@H]1CC[C@H](Cn2nc(-c3ccc(F)cc3)c3cnc(NCCCc4ccccc4)nc23)CC1
: