Target
Regulator of G-protein signaling 8
Ligand
BDBM50384756
Substrate
Meas. Tech.
ChEMBL_821036 (CHEMBL2039223)
IC50
17500±n/a nM
Citation
 Turner, EMBlazer, LLNeubig, RRHusbands, SM Small Molecule Inhibitors of Regulator of G Protein Signalling (RGS) Proteins. ACS Med Chem Lett 3:146-150 (2012)  
Target
Name:
Regulator of G-protein signaling 8
Synonyms:
RGS8 Regulator of G-protein signaling 8 (RGS8)
Type:
Enzyme Catalytic Domain
Mol. Mass.:
20925.80
Organism:
Homo sapiens (Human)
Description:
gi_74355113
Residue:
180
  
Inhibitor
Name:
BDBM50384756
Synonyms:
CHEMBL2037353
Type:
Small organic molecule
Emp. Form.:
C16H13ClN2O2S
Mol. Mass.:
332.805
SMILES:
Cc1ccc(cc1)-n1sc(=O)n(Cc2cccc(Cl)c2)c1=O
: