Target
G-protein coupled receptor 35
Ligand
BDBM85507
Substrate
Meas. Tech.
ChEMBL_821044 (CHEMBL2039370)
EC50
1150±n/a nM
Citation
 Deng, HHu, HLing, SFerrie, AMFang, Y Discovery of Natural Phenols as G Protein-Coupled Receptor-35 (GPR35) Agonists. ACS Med Chem Lett 3:165-169 (2012)  
Target
Name:
G-protein coupled receptor 35
Synonyms:
G protein-coupled receptor 35 GPR35_HUMAN
Type:
Enzyme Catalytic Domain
Mol. Mass.:
34085.57
Organism:
Homo sapiens (Human)
Description:
gi_33695097
Residue:
309
  
Inhibitor
Name:
BDBM85507
Synonyms:
CAS_4394-00-7 Niflumic acid US10278929, Niflumic acid US20240002326, Compound Niflumic acid
Type:
Small organic molecule
Emp. Form.:
C13H9F3N2O2
Mol. Mass.:
282.218
SMILES:
OC(=O)c1cccnc1Nc1cccc(c1)C(F)(F)F
: